inre egenskaper
preferred label: internal qualities @en
preferred label: sisäiset ominaisuudet @fi
type: Concept
narrower: fel (defekt)

störningar
preferred label: interferences @en
preferred label: häiriöt @fi
type: Concept
related: fel (defekt)

fel (defekt)
preferred label: faults @en
preferred label: viat @fi
broader: inre egenskaper
in scheme: conceptscheme
related: störningar
source: Suomen kielen perussanakirja
comment: 1) seikka joka aiheuttaa johonkin epäkuntoisuutta, vajaalaatuisuutta tai vähentää jonkin käyttökelpoisuutta, arvoa tms., häviö, virhe, vioittuma, vaurio; 2) sairaus, häiriö, vamma, vajavuus; 3) ihmisen ominaisuuksista; 4) syy
type: Concept