archetypes
broader: information
preferred label: arkkityypit @fi
preferred label: arketyper @sv
related: psychoanalytical theories
in scheme: conceptscheme
comment: fil. uskontoina, myytteinä, taruina yms. ilmenevät yleisinhimilliset henkiset peruskaavat; ihmissuvulle yhteinen sielunsisältö
source: Kielitoimiston sanakirja
type: Concept

information
preferred label: tieto @fi
preferred label: kunskap @sv
type: Concept
narrower: archetypes

psychoanalytical theories
preferred label: psykoanalyyttiset teoriat @fi
preferred label: psykoanalytiska teorier @sv
type: Concept
related: archetypes