communes
preferred label: kommuner (kollektiv) @sv
preferred label: kommuunit @fi
type: Concept
narrower: Penedo

Penedo
alternative label: Fazenda Penedo @fi
source: Lähde: Penedo, suomalaiskylä Brasiliassa
type: Concept
in scheme: conceptscheme
broader: communes
scope note: Suomalainen 1920-luvulla perustettu ihannesiirtokunta Brasiliassa