matter
preferred label: aine @fi
preferred label: materia @sv
type: Concept
narrower: biomass

biomass
type: Concept
source: Energiasanasto TSK 16
preferred label: biomassa @sv
related: bioenergy
comment: eloperäinen aine, joka ei ole lainkaan tai on vain vähän muuntunut
broader: matter
in scheme: conceptscheme

bioenergy
preferred label: bioenergi @sv
preferred label: bioenergia @fi
type: Concept
related: biomass