aarnikotkat
in scheme: conceptscheme
preferred label: griffins @en
preferred label: gripar @sv
scope note: Tarkoittaa tarueläintä, joka kuviteltiin siivekkääksi kotkanpäiseksi leijonaksi, kultakaivosten vartijaksi
type: Concept
broader: taruolennot
source: Lähde: CD-Facta
alternative label: griipit

taruolennot
preferred label: mythical creatures @en
preferred label: mytologiska väsen @sv
type: Concept
narrower: aarnikotkat