sodat (tapahtumat)
preferred label: wars @en
preferred label: krig @sv
type: Concept
narrower: Viron vapaussota

Viron vapaussota
preferred label: estniska frihetskriget @sv
preferred label: Estonian War of Independence @en
scope note: Virossa v. 1918-20 käyty sota venäläisiä, kommunisteja ja saksalaisia vastaan
source: Lähde: Historian suursanakirja
broader: sodat (tapahtumat)
type: Concept
in scheme: conceptscheme