stödbostäder
comment: tukiasumiseen tarkoitettu asunto. Tukiasunto on sosiaaliviranomaisten hallinnassa tai omistuksessa.
in scheme: conceptscheme
preferred label: supportive housing @en
preferred label: tukiasunnot @fi
broader: bostäder
type: Concept
source: Sosiaaliturvan sanasto
related: boendeservice

bostäder
preferred label: homes @en
preferred label: asunnot @fi
type: Concept
narrower: stödbostäder

boendeservice
preferred label: housing services @en
preferred label: asumispalvelut @fi
type: Concept
related: stödbostäder