muinaiskansaan liittyvä rooli
preferred label: role related to ancient peoples @en
preferred label: forntidsfolksroll @sv
type: Concept
narrower: traakit

traakit
broader: muinaiskansaan liittyvä rooli
preferred label: thraker @sv
preferred label: Thracians @en
alternative label: traakialaiset
in scheme: conceptscheme
comment: kulttuurisesti ja kielellisesti toisiaan lähellä olleita indoeurooppalaisia kansanryhmiä, jotka elivät laajalla alueella nykyisissä Koillis-Kreikassa, Bulgariassa, Romaniassa, itäisessä Unkarissa, Slovakiassa, Serbiassa, Makedoniassa, Moldovassa ja Länsi-Ukrainassa
source: http://www.amosanderson.fi/suomi/nayt2000.html
type: Concept