värjäys tekniikan mukaan
type: Collection
member: ikat

värjäys
preferred label: färgning @sv
preferred label: dyeing @en
type: Concept
narrower: ikat

ikat
type: Concept
scope note: Sumatralla, Borneossa ja Balilla käytetty perinteinen indonesialainen värjäystekniikka
broader: värjäys
alternative label: ikatti
alternative label: ikkat @en
in scheme: conceptscheme