odlade bär
preferred label: cultivated berries @en
preferred label: viljellyt marjat @fi
type: Concept
broader: bär

vilda bär
preferred label: wild berries @en
preferred label: luonnonmarjat @fi
type: Concept
broader: bär

vilda naturprodukter
preferred label: wild natural products @en
preferred label: keräilytuotteet @fi
type: Concept
related: bär

frukter
preferred label: fruit @en
preferred label: hedelmät @fi
type: Concept
narrower: bär

bär
scope note: Sanasto sisältää yleisimpien marjojen nimiä; myös kaikkia muita voi käyttää asiasanoina
scope note: Registret upptar namnen på de vanligaste bären; även alla andra bär kan användas som ämnesord
preferred label: marjat @fi
preferred label: berries @en
source: Biologian sanakirja
narrower: odlade bär
narrower: vilda bär
related: vilda naturprodukter
broader: frukter
comment: sanasto sisältää yleisimpien marjojen nimiä; myös kaikkia muita voi käyttää asiasanoina yhdestä tai useammasta yhtyneestä emilehdestä kehittyvä mehevä hedelmä
in scheme: conceptscheme
type: Concept