methods of treatment
preferred label: behandlingsmetoder @sv
preferred label: hoitomenetelmät @fi
type: Concept
narrower: Women for Sobriety

Women for Sobriety
broader: methods of treatment
source: Lähde: Kirkpatrick,J., Täyskäännös
scope note: Amerikkalaisen Jean Kirkpatrickin kehittämä naisten vertaistukeen ja ryhmätoimintaan perustuva oma-apuohjelma päihderiippuvaisille naisille
in scheme: conceptscheme
type: Concept