muu rooli
preferred label: annan roll @sv
preferred label: other role @en
type: Concept
narrower: syyt

syyt
type: Concept
preferred label: causes @en
preferred label: orsaker @sv
narrower: kuolemansyyt
in scheme: conceptscheme
comment: 1) seikka josta jk toinen seikka, ilmiö, tapahtuma, teko tms. aiheutuu t. johtuu, seikka jonka takia jtak tapahtuu t. tehdään, aihe, peruste, vaikutin, motiivi; 2) se, että jku t. jk on aiheuttanut jnk kielteisen, epämieluisan, pahan, rikollisen, rangaistavan tms. seikan, vastuullisuus, vika, syyllisyys; 3) rihmamainen eläin- t. kasvisolu t. sen osa, kuitu, säie
broader: muu rooli
source: Kielitoimiston sanakirja

kuolemansyyt
preferred label: dödsorsaker @sv
preferred label: causes of death @en
type: Concept
broader: syyt