background music
preferred label: bakgrundsmusik @sv
preferred label: taustamusiikki @fi
type: Concept
narrower: muzak

muzak
broader: background music
in scheme: conceptscheme
source: Kielitoimiston sanakirja
comment: musakki: julkisissa tiloissa äänentoistolaitteella levitettävä taustamusiikki (englanninkielisestä tavaramerkistä Muzak)
type: Concept