inre egenskaper
preferred label: internal qualities @en
preferred label: sisäiset ominaisuudet @fi
type: Concept
narrower: form (utformning)

sonatform
preferred label: sonata form @en
preferred label: sonaattimuoto @fi
type: Concept
broader: form (utformning)

form (utformning)
type: Concept
preferred label: form
preferred label: muoto (rakenteellinen) @fi
comment: 1) fyysisen olion ulkoisten piirteiden kokonaisuus, hahmo, ulkomuoto; 2) olo-, ilmenemismuoto, olotila; asu, hahmo, rakenne; 3) tavasta jolla jokin toiminta teko, ilmiö tms. (ulkonaisesti, käytännössä) ilmenee; 4) kirjallisen tai suullisen esityksen, taideteoksen tms. rakenteellinen kokonaishahmo; 5) lain, asetusten, sääntöjen, vakiintuneen käytännön tms. määräämä, edellyttämä tai niiden mukainen menettelytapa; 6) laji, tyyppi
broader: inre egenskaper
source: Suomen kielen perussanakirja
narrower: sonatform
in scheme: conceptscheme