metodologia
preferred label: metodologi @sv
preferred label: methodology @en
type: Concept
narrower: pehmeä systeemimetodologia

pehmeä systeemimetodologia
broader: metodologia
preferred label: Soft systems methodology @en
alternative label: SSM
source: Lähde: Tulevaisuudentutkimus : perusteet ja sovelluksia
type: Concept
in scheme: conceptscheme
scope note: Toimintatutkimukseen pohjautuva menetelmä, joka periaatteiltaan pohjautuu prof. Peter Checklandin vuonna 1985 kehittämään ja 1990-luvulla uudelleenjäsentämään työskentelytapaan. Tulevaisuudentutkimuksessa menetelmän avulla pyritään löytämään yhteys päätöksentekoyksiköiden (kuten yritysten ja kuntien) tavoitteiden asettelun, tulevaisuuden tutkimuksen tuottamien visioiden ja nykyisyyttä koskevan itseymmärryksen välille. Tästä tiedosta synnytetään näkemys muutosprosessista, jolla päätöksentekoyksikkö voi varautua erilaisiin mahdollisiin tulevaisuuksiin