religious events
preferred label: religiösa sammankomster @sv
preferred label: uskonnolliset tilaisuudet @fi
type: Concept
related: bishop's visitations

inspection
preferred label: granskning @sv
preferred label: tarkastus @fi
type: Concept
narrower: bishop's visitations

bishop's visitations
related: religious events
preferred label: piispantarkastukset @fi
preferred label: biskopsvisitationer @sv
broader: inspection
comment: Piispantarkastus tarkoittaa piispan vierailua seurakunnassa. Piispa tapaa seurakunnan työntekijöitä, luottamushenkilöitä ja muita seurakuntalaisia. Hän tutustuu seurakunnan toimintaan ja yhteistyökumppaneihin. Piispantarkastuksen aikana keskustellaan seurakuntatyön painopisteistä, arvioidaan uusia haasteita ja mietitään toiminnan kehittämistä.
in scheme: conceptscheme
type: Concept