bioplastic
preferred label: biomuovi @fi
preferred label: bioplast @sv
type: Concept
broader: biomaterials
broader: plastic
scope note: Tarkoittaa esim. bakteerien ja biojätteiden yhteistuloksena tehtyä muovia
in scheme: conceptscheme

biomaterials
preferred label: biomaterial @sv
preferred label: biomateriaalit @fi
type: Concept
narrower: bioplastic

plastic
preferred label: plast @sv
preferred label: muovi @fi
type: Concept
narrower: bioplastic