religiösa fenomen
preferred label: religious phenomena @en
preferred label: uskonnolliset ilmiöt @fi
type: Concept
narrower: gudinnor

gudar
preferred label: gods @en
preferred label: jumalat @fi
type: Concept
related: gudinnor

gudinnor
scope note: Jumalattarien nimiä voi käyttää asiasanoina, esim. Isis, Afrodite
scope note: Namn på gudinnor kan användas som ämnesord, t.ex. Isis, Afrodite
broader: religiösa fenomen
preferred label: goddesses @en
preferred label: jumalattaret @fi
in scheme: conceptscheme
type: Concept
related: gudar