kyberavaruus
in scheme: conceptscheme
related: virtuaalitodellisuus
related: täydennetty todellisuus
related: virtuaaliympäristö
scope note: Parallell värld där människor kan kommunicera med text, bild och ljud, oberoende av fysiska avstånd, tack vare datorer. Ordet används om webben och olika former av virtuell verklighet. @sv
scope note: Kyberavaruus eli kybertila on ympäristö, joka koostetaan sekä todesta että epätodesta sähköisestä informaatiosta ja liitetään todelliseen maailmaan joko yksisuuntaisten (esim. televisio) tai kaksisuuntaisten (esim. tietokoneet ja puhelin) porttien avulla
alternative label: verkkoavaruus
alternative label: kybertila
type: Concept
source: Lähde: Smith, D., VRML & 3-D
preferred label: cyberspace @en
preferred label: cyberrymd @sv
broader: tekniset tuotokset

tekniset tuotokset
preferred label: tekniska alster @sv
preferred label: technical accomplishments @en
type: Concept
narrower: kyberavaruus

virtuaaliympäristö
preferred label: virtuell miljö @sv
type: Concept
related: kyberavaruus

täydennetty todellisuus
preferred label: augmented reality @en
preferred label: förstärkt verklighet @sv
type: Concept
related: kyberavaruus

virtuaalitodellisuus
preferred label: virtual reality @en
preferred label: virtuell verklighet @sv
type: Concept
related: kyberavaruus