universe
preferred label: maailmankaikkeus @fi
preferred label: universum @sv
type: Concept
related: multiverse

systems in natural science
preferred label: naturvetenskapliga system @sv
preferred label: luonnontieteelliset järjestelmät @fi
type: Concept
narrower: multiverse

multiverse
broader: systems in natural science
preferred label: multiversumi @fi
preferred label: multiversum @sv
related: universe
comment: Multiversumilla tarkoitetaan kaikkien vaihtoehtoisten universumien muodostamaa universumijoukkoa.
type: Concept
in scheme: conceptscheme