muoto-opilliset ilmiöt
type: Concept
narrower: aspekti

aspekti
preferred label: aspekt @sv
preferred label: aspect @en
source: Kielitoimiston sanakirja
in scheme: conceptscheme
comment: verbin ilmaiseman toiminnan luonne esim. tekemisen keston kannalta
broader: muoto-opilliset ilmiöt
type: Concept