teoriat (tuotokset)
preferred label: teorier (alster) @sv
preferred label: theories @en
type: Concept
narrower: fysiognomia (teoriat)

fysiognomia (teoriat)
comment: fysiognomia (< kreik.), lat. physiognomia, fysionomia, ulkonäkö, kasvot, kasvojen piirteet, ilme; antiikista peräisin oleva käsitys luonteenpiirteiden ilmenemisestä kasvoissa; luonteenpiirteiden tai sairauden päätteleminen kasvoista
preferred label: fysiognomik @sv
preferred label: physiognomy @en
alternative label: fysiognomia
alternative label: fysionomia
broader: teoriat (tuotokset)
source: WebFacta
in scheme: conceptscheme
type: Concept