Operation Barbarossa
scope note: Saksalaisten käyttämä peitenimi suunnitelmastaan hyökätä Neuvostoliittoon v. 1941
preferred label: Barbarossa-suunnitelma @fi
in scheme: conceptscheme
broader: planer
related: andra världskriget
type: Concept

planer
preferred label: plans @en
preferred label: suunnitelmat @fi
type: Concept
narrower: Operation Barbarossa

andra världskriget
preferred label: second world war @en
preferred label: toinen maailmansota @fi
type: Concept
related: Operation Barbarossa