3D-bilder
preferred label: havainnekuvat @fi
preferred label: conceptual pictures @en
scope note: Kolmiulotteinen kuva, jota käytetään esim. kaavoituksen ja arkkitehtuurin havainnollistamiseen
scope note: 3D (förkortning för "tre dimensioner", det vill säga höjd, bredd och djup) är en beteckning som används för visualiseringssystem (som bilder eller filmer) som försöker ge betraktaren ett intryck av djup i en egentligen tvådimensionell bild.
type: Concept
in scheme: conceptscheme
broader: bilder

bilder
preferred label: pictures @en
preferred label: kuvat @fi
type: Concept
narrower: 3D-bilder