laamannit (ammatit)
alternative label: laamannit
preferred label: Chief Judge of the District Court (occupations) @en
preferred label: lagmän (ämbete) @sv
broader: ammatit
in scheme: conceptscheme
type: Concept
comment: käräjäoikeuden puheenjohtaja (ja hallinnollinen päällikkö)
source: Kielitoimiston sanakirja

ammatit
preferred label: occupations @en
preferred label: yrken @sv
type: Concept
narrower: laamannit (ammatit)