pragmatik
preferred label: pragmatics @en
preferred label: pragmatiikka @fi
type: Concept
related: talakt

talakt
broader: språkliga fenomen
preferred label: speech act @en
preferred label: puheakti @fi
comment: Puheakti (speech act) on sellainen puhejakso, jolla on tietyssä tilanteessa määrätarkoitus ja jonka puhuja ja kuulija yleensä yhdistävät samalla tavalla tiettyyn kontaktitilanteeseen.
related: pragmatik
type: Concept
source: http://www.internetix.ofw.fi/opinnot/opintojaksot/8kieletkirjallisuus/pragmatiikka/puheakti.html
in scheme: conceptscheme

språkliga fenomen
preferred label: linguistic phenomena @en
preferred label: kielelliset ilmiöt @fi
type: Concept
narrower: talakt