muotit
preferred label: formar (mallar) @sv
preferred label: molds @en
type: Concept
related: mallit (tehtävä)

mallit (tehtävä)
preferred label: modeller (människor) @sv
preferred label: models @en
broader: toimintaan liittyvä rooli
type: Concept
source: Suomen kielen perussanakirja
related: muotit
alternative label: mallit
comment: ihmisestä a) kuvataiteilijan aiheenaan käyttämä kohde; b) muotia (vaatteita, koruja tms.) yllään esittelevä henkilö, mannekiini
in scheme: conceptscheme

toimintaan liittyvä rooli
preferred label: role related to action @en
preferred label: sysselsättningsrelaterad roll @sv
type: Concept
narrower: mallit (tehtävä)