naturprodukter
preferred label: luonnontuotteet @fi
preferred label: natural products @en
scope note: Medel vars verksamma beståndsdelar är rena naturprodukter.
in scheme: conceptscheme
alternative label: naturmedel
type: Concept
broader: produkter

produkter
preferred label: tuotteet (konkreta resultat) @fi
preferred label: products @en
type: Concept
narrower: naturprodukter